Reaction Details
TargetDipeptidyl peptidase 4
LigandBDBM11501
Substrate/CompetitorBDBM11057
Meas. Tech.Dipeptidyl Peptidase Inhibition Assay
IC50 110±n/a nM
Citation Xu, JWei, LMathvink, RHe, JPark, YJHe, HLeiting, BLyons, KAMarsilio, FPatel, RAWu, JKThornberry, NAWeber, AE Discovery of potent and selective phenylalanine based dipeptidyl peptidase IV inhibitors. Bioorg Med Chem Lett15:2533-6 (2005) 
 
Dipeptidyl peptidase 4
Name:Dipeptidyl peptidase 4
Type:Enzyme
Mol. Mass.:88271.01
Organism:Homo sapiens (Human)
Description:P27487
Residue:766
BDBM11501
BDBM11057
NameBDBM11501
Synonyms:(2S,3S)-1-[(3S)-3-fluoropyrrolidin-1-yl]-3-[4-(3-methanesulfonylphenyl)phenyl]-1-oxobutan-2-aminium; 2,2,2-trifluoroacetate | 3-(S)-fluoropyrrolidide 21
TypeSmall organic molecule
Emp. Form.C21H26FN2O3S
Mol. Mass.405.506
SMILESC[C@H]([C@H]([NH3+])C(=O)N1CC[C@H](F)C1)c1ccc(cc1)-c1cccc(c1)S(C)(=O)=O