Reaction Details
TargetDipeptidyl peptidase 2
LigandBDBM11499
Substrate/CompetitorBDBM11156
Meas. Tech.Dipeptidyl Peptidase Inhibition Assay
IC50 250±n/a nM
Citation Xu, JWei, LMathvink, RHe, JPark, YJHe, HLeiting, BLyons, KAMarsilio, FPatel, RAWu, JKThornberry, NAWeber, AE Discovery of potent and selective phenylalanine based dipeptidyl peptidase IV inhibitors. Bioorg Med Chem Lett15:2533-6 (2005) 
 
Dipeptidyl peptidase 2
Name:Dipeptidyl peptidase 2
Type:Protein
Mol. Mass.:54339.29
Organism:Homo sapiens (Human)
Description:Q9UHL4
Residue:492
BDBM11499
BDBM11156
NameBDBM11499
Synonyms:(2S,3S)-1-[(3S)-3-fluoropyrrolidin-1-yl]-3-[4-(3-methanesulfonamidophenyl)phenyl]-1-oxobutan-2-aminium; 2,2,2-trifluoroacetate | 3-(S)-fluoropyrrolidide 19
TypeSmall organic molecule
Emp. Form.C21H27FN3O3S
Mol. Mass.420.52
SMILESC[C@H]([C@H]([NH3+])C(=O)N1CC[C@H](F)C1)c1ccc(cc1)-c1cccc(NS(C)(=O)=O)c1