Reaction Details
TargetDipeptidyl peptidase 2
LigandBDBM11516
Substrate/CompetitorBDBM11156
Meas. Tech.Dipeptidyl Peptidase Inhibition Assay
IC50 2500±n/a nM
Citation Xu, JWei, LMathvink, RHe, JPark, YJHe, HLeiting, BLyons, KAMarsilio, FPatel, RAWu, JKThornberry, NAWeber, AE Discovery of potent and selective phenylalanine based dipeptidyl peptidase IV inhibitors. Bioorg Med Chem Lett15:2533-6 (2005) 
 
Dipeptidyl peptidase 2
Name:Dipeptidyl peptidase 2
Type:Protein
Mol. Mass.:54339.29
Organism:Homo sapiens (Human)
Description:Q9UHL4
Residue:492
BDBM11516
BDBM11156
NameBDBM11516
Synonyms:(2S,3S)-3-[4-(2,4-difluorophenyl)phenyl]-1-[(3S)-3-fluoropyrrolidin-1-yl]-1-oxobutan-2-aminium; 2,2,2-trifluoroacetate | 3-(S)-fluoropyrrolidide 36
TypeSmall organic molecule
Emp. Form.C20H22F3N2O
Mol. Mass.363.3961
SMILESC[C@H]([C@H]([NH3+])C(=O)N1CC[C@H](F)C1)c1ccc(cc1)-c1ccc(F)cc1F