Reaction Details
TargetDipeptidyl peptidase 8
LigandBDBM11465
Substrate/CompetitorBDBM11561
Meas. Tech.Dipeptidyl Peptidase Inhibition Assay
IC50 220±n/a nM
Citation Xu, JWei, LMathvink, RHe, JPark, YJHe, HLeiting, BLyons, KAMarsilio, FPatel, RAWu, JKThornberry, NAWeber, AE Discovery of potent and selective phenylalanine based dipeptidyl peptidase IV inhibitors. Bioorg Med Chem Lett15:2533-6 (2005) 
 
Dipeptidyl peptidase 8
Name:Dipeptidyl peptidase 8
Type:Enzyme
Mol. Mass.:103342.62
Organism:Homo sapiens (Human)
Description:Q6V1X1
Residue:898
BDBM11465
BDBM11561
NameBDBM11465
Synonyms:(2S,3R)-2-amino-3-methyl-1-(1,3-thiazolidin-3-yl)pentan-1-one | thiazolidide 3
TypeSmall organic molecule
Emp. Form.C9H18N2OS
Mol. Mass.202.317
SMILESCC[C@@H](C)[C@H](N)C(=O)N1CCSC1