Reaction Details
TargetHistone deacetylase 3
LigandBDBM323704
Substrate/Competitorn/a
Meas. Tech.HDAC Inhibition Assay
IC50 0.400±n/a nM
Citation Hooker, JMWang, CSchroeder, FA Imaging histone deacetylases with a radiotracer using positron emission tomography US Patent US10188756 Publication Date 1/29/2019
 
Histone deacetylase 3
Name:Histone deacetylase 3
Type:Enzyme
Mol. Mass.:48829.55
Organism:Homo sapiens (Human)
Description:O15379
Residue:428
BDBM323704
NameBDBM323704
Synonyms:US10188756, Compound CN107
TypeSmall organic molecule
Emp. Form.C21H23N3O2
Mol. Mass.349.4262
SMILESCn1cc(CCNCc2ccc(\C=C\C(=O)NO)cc2)c2ccccc12