Reaction Details
TargetHistone deacetylase 2
LigandBDBM50397360
Substrate/Competitorn/a
Meas. Tech.HDAC Inhibition Assay
IC50 1740±n/a nM
Citation Hooker, JMWang, CSchroeder, FA Imaging histone deacetylases with a radiotracer using positron emission tomography US Patent US10188756 Publication Date 1/29/2019
 
Histone deacetylase 2
Name:Histone deacetylase 2
Type:Chromatin regulator; hydrolase; repressor
Mol. Mass.:55356.54
Organism:Homo sapiens (Human)
Description:Q92769
Residue:488
BDBM50397360
NameBDBM50397360
Synonyms:CHEMBL2170177 | US10188756, Compound CN110
TypeSmall organic molecule
Emp. Form.C17H16N2O3
Mol. Mass.296.3205
SMILESCOc1ccc(Cn2ccc3ccc(cc23)C(=O)NO)cc1