Reaction Details
TargetHistone deacetylase 3
LigandBDBM323707
Substrate/Competitorn/a
Meas. Tech.HDAC Inhibition Assay
IC50 1.30±n/a nM
Citation Hooker, JMWang, CSchroeder, FA Imaging histone deacetylases with a radiotracer using positron emission tomography US Patent US10188756 Publication Date 1/29/2019
 
Histone deacetylase 3
Name:Histone deacetylase 3
Type:Enzyme
Mol. Mass.:48829.55
Organism:Homo sapiens (Human)
Description:O15379
Residue:428
BDBM323707
NameBDBM323707
Synonyms:US10188756, Compound CN113
TypeSmall organic molecule
Emp. Form.C20H22N2O6S
Mol. Mass.418.463
SMILESCOc1ccc2c(c1)C(=O)N(CCCCCC(=O)NO)c1ccccc1S2(=O)=O