Reaction Details
TargetCoagulation factor IX
LigandBDBM324178
Substrate/Competitorn/a
Meas. Tech.Determination of Inhibitory Activity Against Factor IXa
IC50 3.64±n/a nM
Citation Zhang, TChen, YGuo, LHruza, AJian, TLi, BMeng, DParker, DLSherer, ECWood, HBSakurada, I Factor IXa inhibitors US Patent US10189819 Publication Date 1/29/2019
 
Coagulation factor IX
Name:Coagulation factor IX
Type:Enzyme
Mol. Mass.:51768.83
Organism:Homo sapiens (Human)
Description:P00740
Residue:461
BDBM324178
NameBDBM324178
Synonyms:US10189819, Example 7
TypeSmall organic molecule
Emp. Form.C26H22Cl2N6O
Mol. Mass.505.398
SMILESCc1cc2nc([nH]c2cc1C)C(CNC(=O)c1c(Cl)cc(cc1Cl)-n1cnnc1)c1ccccc1