Reaction Details
TargetCoagulation factor IX
LigandBDBM324179
Substrate/Competitorn/a
Meas. Tech.Determination of Inhibitory Activity Against Factor IXa
IC50 6.99±n/a nM
Citation Zhang, TChen, YGuo, LHruza, AJian, TLi, BMeng, DParker, DLSherer, ECWood, HBSakurada, I Factor IXa inhibitors US Patent US10189819 Publication Date 1/29/2019
 
Coagulation factor IX
Name:Coagulation factor IX
Type:Enzyme
Mol. Mass.:51768.83
Organism:Homo sapiens (Human)
Description:P00740
Residue:461
BDBM324179
NameBDBM324179
Synonyms:US10189819, Example 8
TypeSmall organic molecule
Emp. Form.C28H27ClN6O
Mol. Mass.499.007
SMILESCc1ncn(n1)-c1cc(C)c(C(=O)NCC(c2nc3cc(C)c(C)cc3[nH]2)c2ccccc2)c(Cl)c1