Reaction Details
TargetCoagulation factor IX
LigandBDBM324227
Substrate/Competitorn/a
Meas. Tech.Determination of Inhibitory Activity Against Factor IXa
IC50 6.10±n/a nM
Citation Zhang, TChen, YGuo, LHruza, AJian, TLi, BMeng, DParker, DLSherer, ECWood, HBSakurada, I Factor IXa inhibitors US Patent US10189819 Publication Date 1/29/2019
 
Coagulation factor IX
Name:Coagulation factor IX
Type:Enzyme
Mol. Mass.:51768.83
Organism:Homo sapiens (Human)
Description:P00740
Residue:461
BDBM324227
NameBDBM324227
Synonyms:US10189819, Example 64
TypeSmall organic molecule
Emp. Form.C29H25Cl3N6O4
Mol. Mass.627.906
SMILESCOC(=O)Cc1cccc(c1)C(CNC(=O)c1c(Cl)cc(cc1Cl)-n1cnc(C)n1)c1nc2cc(OC)c(Cl)cc2[nH]1