Reaction Details
TargetCoagulation factor IX
LigandBDBM50125978
Substrate/Competitorn/a
Meas. Tech.Determination of Inhibitory Activity Against Factor IXa
IC50 3.70±n/a nM
Citation Zhang, TChen, YGuo, LHruza, AJian, TLi, BMeng, DParker, DLSherer, ECWood, HBSakurada, I Factor IXa inhibitors US Patent US10189819 Publication Date 1/29/2019
 
Coagulation factor IX
Name:Coagulation factor IX
Type:Enzyme
Mol. Mass.:51768.83
Organism:Homo sapiens (Human)
Description:P00740
Residue:461
BDBM50125978
NameBDBM50125978
Synonyms:CHEMBL3627898 | US10189819, Example 77
TypeSmall organic molecule
Emp. Form.C26H21Cl2FN6O
Mol. Mass.523.389
SMILESCc1ncn(n1)-c1cc(Cl)c(C(=O)NC[C@@H](c2cccc(F)c2)c2cnc3[nH]c(C)cc3c2)c(Cl)c1