Reaction Details
TargetCoagulation factor IX
LigandBDBM324248
Substrate/Competitorn/a
Meas. Tech.Determination of Inhibitory Activity Against Factor IXa
IC50 10.7±n/a nM
Citation Zhang, TChen, YGuo, LHruza, AJian, TLi, BMeng, DParker, DLSherer, ECWood, HBSakurada, I Factor IXa inhibitors US Patent US10189819 Publication Date 1/29/2019
 
Coagulation factor IX
Name:Coagulation factor IX
Type:Enzyme
Mol. Mass.:51768.83
Organism:Homo sapiens (Human)
Description:P00740
Residue:461
BDBM324248
NameBDBM324248
Synonyms:US10189819, Example 102
TypeSmall organic molecule
Emp. Form.C27H22ClFN6O2
Mol. Mass.516.954
SMILESCc1ncn(n1)-c1ccc(C(=O)NC[C@@H](c2ccccc2)c2nc3c(F)ccc(C)c3c(=O)[nH]2)c(Cl)c1