Reaction Details
TargetCoagulation factor IX
LigandBDBM324251
Substrate/Competitorn/a
Meas. Tech.Determination of Inhibitory Activity Against Factor IXa
IC50 3.32±n/a nM
Citation Zhang, TChen, YGuo, LHruza, AJian, TLi, BMeng, DParker, DLSherer, ECWood, HBSakurada, I Factor IXa inhibitors US Patent US10189819 Publication Date 1/29/2019
 
Coagulation factor IX
Name:Coagulation factor IX
Type:Enzyme
Mol. Mass.:51768.83
Organism:Homo sapiens (Human)
Description:P00740
Residue:461
BDBM324251
NameBDBM324251
Synonyms:US10189819, Example 105
TypeSmall organic molecule
Emp. Form.C31H19Cl2F2N5O4
Mol. Mass.634.416
SMILESOC(=O)c1ccc2n(cnc2c1)-c1ccc(C(=O)NCC(c2cccc(F)c2)c2nc3c(F)ccc(Cl)c3c(=O)[nH]2)c(Cl)c1