Reaction Details
TargetCoagulation factor IX
LigandBDBM324252
Substrate/Competitorn/a
Meas. Tech.Determination of Inhibitory Activity Against Factor IXa
IC50 8.50±n/a nM
Citation Zhang, TChen, YGuo, LHruza, AJian, TLi, BMeng, DParker, DLSherer, ECWood, HBSakurada, I Factor IXa inhibitors US Patent US10189819 Publication Date 1/29/2019
 
Coagulation factor IX
Name:Coagulation factor IX
Type:Enzyme
Mol. Mass.:51768.83
Organism:Homo sapiens (Human)
Description:P00740
Residue:461
BDBM324252
NameBDBM324252
Synonyms:US10189819, Example 106
TypeSmall organic molecule
Emp. Form.C28H20ClF2N5O2
Mol. Mass.531.941
SMILESCc1ccc(F)c2nc([nH]c(=O)c12)[C@@H](CNC(=O)c1ccc(cc1Cl)-c1ccnnc1)c1cccc(F)c1