Reaction Details
TargetCoagulation factor IX
LigandBDBM324257
Substrate/Competitorn/a
Meas. Tech.Determination of Inhibitory Activity Against Factor IXa
IC50 9.60±n/a nM
Citation Zhang, TChen, YGuo, LHruza, AJian, TLi, BMeng, DParker, DLSherer, ECWood, HBSakurada, I Factor IXa inhibitors US Patent US10189819 Publication Date 1/29/2019
 
Coagulation factor IX
Name:Coagulation factor IX
Type:Enzyme
Mol. Mass.:51768.83
Organism:Homo sapiens (Human)
Description:P00740
Residue:461
BDBM324257
NameBDBM324257
Synonyms:US10189819, Example 111
TypeSmall organic molecule
Emp. Form.C27H19ClF4N6O2
Mol. Mass.570.925
SMILESCc1ccc(F)c2nc([nH]c(=O)c12)[C@@H](CNC(=O)c1ccc(cc1Cl)-n1cnnc1C(F)F)c1cccc(F)c1