Reaction Details
TargetSerine/threonine-protein kinase B-raf [416-766,V600E]
LigandBDBM189302
Substrate/Competitorn/a
Meas. Tech.Raf IC50 Assay
Temperature298.15±n/a K
IC50 780±n/a nM
Commentsextracted
Citation Zhou, CZhang, G Fused tricyclic urea compounds as Raf kinase and/or Raf kinase dimer inhibitors US Patent US9670203 Publication Date 6/6/2017
 
Serine/threonine-protein kinase B-raf [416-766,V600E]
Name:Serine/threonine-protein kinase B-raf [416-766,V600E]
Type:n/a
Mol. Mass.:39690.71
Organism:Homo sapiens (Human)
Description:PV3849, from Invitrogen
Residue:351
BDBM189302
NameBDBM189302
Synonyms:US9670203, Compound 1.46
TypeSmall organic molecule
Emp. Form.C24H17F3N4O4
Mol. Mass.482.4114
SMILESFc1ccc(NC(=O)N[C@@H]2[C@H]3Oc4ccc(Oc5ccnc6NC(=O)CCc56)cc4[C@@H]23)c(F)c1F