Reaction Details
TargetGag-Pol polyprotein
LigandBDBM267389
Substrate/Competitorn/a
Meas. Tech.Determination of HIV-1 Reverse Transcriptase Inhibitory Activity
IC50 3.00±n/a nM
Citation Arrington, KLHan, YLi, YLuo, YPatel, M Non-nucleoside reverse transcriptase inhibitors US Patent US10189831 Publication Date 1/29/2019
 
Gag-Pol polyprotein
Name:Gag-Pol polyprotein
Type:Protein
Mol. Mass.:162074.74
Organism:Human immunodeficiency virus type 1 group M subtype B (isolate HXB2)
Description:P04585
Residue:1435
BDBM267389
NameBDBM267389
Synonyms:2-fluoro-3-((1-((5-(4-fluorophenyl)-6-oxo-1,6-dihydropyridazin-3-yl)methyl)-6-oxo-4-(trifluoromethyl)-1,6-dihydropyrimidin-5-yl)oxy)benzonitrile US9718819, 165
TypeSmall organic molecule
Emp. Form.C23H12F5N5O3
Mol. Mass.501.3651
SMILESFc1ccc(cc1)-c1cc(Cn2cnc(c(Oc3cccc(C#N)c3F)c2=O)C(F)(F)F)n[nH]c1=O