Reaction Details
TargetGag-Pol polyprotein
LigandBDBM267395
Substrate/Competitorn/a
Meas. Tech.Determination of HIV-1 Reverse Transcriptase Inhibitory Activity
IC50 3.00±n/a nM
Citation Arrington, KLHan, YLi, YLuo, YPatel, M Non-nucleoside reverse transcriptase inhibitors US Patent US10189831 Publication Date 1/29/2019
 
Gag-Pol polyprotein
Name:Gag-Pol polyprotein
Type:Protein
Mol. Mass.:162074.74
Organism:Human immunodeficiency virus type 1 group M subtype B (isolate HXB2)
Description:P04585
Residue:1435
BDBM267395
NameBDBM267395
Synonyms:3-((4-(1,1-difluoroethyl)-1-((5-(4-fluorophenyl)-6-oxo-1,6-dihydropyridazin-3-yl)methyl)-6-oxo-1,6-dihydropyrimidin-5-yl)oxy)-2-fluorobenzonitrile US9718819, 171
TypeSmall organic molecule
Emp. Form.C24H15F4N5O3
Mol. Mass.497.4012
SMILESCC(F)(F)c1ncn(Cc2cc(-c3ccc(F)cc3)c(=O)[nH]n2)c(=O)c1Oc1cccc(C#N)c1F