Reaction Details
TargetCarbonic anhydrase 1
LigandBDBM11626
Substrate/CompetitorBDBM10856
Meas. Tech.CA Inhibition Assay
Ki 1.0±n/a nM
Citation Ilies, MAVullo, DPastorek, JScozzafava, AIlies, MCaproiu, MTPastorekova, SSupuran, CT Carbonic anhydrase inhibitors. Inhibition of tumor-associated isozyme IX by halogenosulfanilamide and halogenophenylaminobenzolamide derivatives. J Med Chem46:2187-96 (2003) 
 
Carbonic anhydrase 1
Name:Carbonic anhydrase 1
Type:Enzyme
Mol. Mass.:28873.37
Organism:Homo sapiens (Human)
Description:P00915
Residue:261
BDBM11626
BDBM10856
NameBDBM11626
Synonyms:β-CA inhibitor, 2 5-{[(4-amino-3-bromo-5-fluorophenyl)sulfonyl]amino}-1,3,4-thiadiazole-2-sulfonamide | aminobenzolamide 19
TypeSmall organic molecule
Emp. Form.C8H7BrFN5O4S3
Mol. Mass.432.27
SMILESNc1c(F)cc(cc1Br)S(=O)(=O)Nc1nnc(s1)S(N)(=O)=O