Reaction Details
TargetCarbonic anhydrase 2
LigandBDBM11622
Substrate/CompetitorBDBM10856
Meas. Tech.CA Inhibition Assay
Ki 0.6±n/a nM
Citation Ilies, MAVullo, DPastorek, JScozzafava, AIlies, MCaproiu, MTPastorekova, SSupuran, CT Carbonic anhydrase inhibitors. Inhibition of tumor-associated isozyme IX by halogenosulfanilamide and halogenophenylaminobenzolamide derivatives. J Med Chem46:2187-96 (2003) 
 
Carbonic anhydrase 2
Name:Carbonic anhydrase 2
Type:Enzyme
Mol. Mass.:29250.71
Organism:Homo sapiens (Human)
Description:P00918
Residue:260
BDBM11622
BDBM10856
NameBDBM11622
Synonyms:β-CA inhibitor, 1 5-(4-Amino-3-chlorobenzenesulfonamido)-1,3,4-thiadiazole-2-sulfonamide | aminobenzolamide 17c
TypeSmall organic molecule
Emp. Form.C8H8ClN5O4S3
Mol. Mass.369.828
SMILESNc1ccc(cc1Cl)S(=O)(=O)Nc1nnc(s1)S(N)(=O)=O