Reaction Details
TargetCarbonic anhydrase 2
LigandBDBM11627
Substrate/CompetitorBDBM10856
Meas. Tech.CA Inhibition Assay
Ki 0.3±n/a nM
Citation Ilies, MAVullo, DPastorek, JScozzafava, AIlies, MCaproiu, MTPastorekova, SSupuran, CT Carbonic anhydrase inhibitors. Inhibition of tumor-associated isozyme IX by halogenosulfanilamide and halogenophenylaminobenzolamide derivatives. J Med Chem46:2187-96 (2003) 
 
Carbonic anhydrase 2
Name:Carbonic anhydrase 2
Type:Enzyme
Mol. Mass.:29250.71
Organism:Homo sapiens (Human)
Description:P00918
Residue:260
BDBM11627
BDBM10856
NameBDBM11627
Synonyms:β-CA inhibitor, 3 5-{[(4-amino-3-fluoro-5-iodophenyl)sulfonyl]amino}-1,3,4-thiadiazole-2-sulfonamide | aminobenzolamide 20
TypeSmall organic molecule
Emp. Form.C8H7FIN5O4S3
Mol. Mass.479.27
SMILESNc1c(F)cc(cc1I)S(=O)(=O)Nc1nnc(s1)S(N)(=O)=O