Reaction Details
TargetCarbonic anhydrase 4
LigandBDBM11633
Substrate/CompetitorBDBM10856
Meas. Tech.CA Inhibition Assay
Ki 2.3±n/a nM
Citation Ilies, MAVullo, DPastorek, JScozzafava, AIlies, MCaproiu, MTPastorekova, SSupuran, CT Carbonic anhydrase inhibitors. Inhibition of tumor-associated isozyme IX by halogenosulfanilamide and halogenophenylaminobenzolamide derivatives. J Med Chem46:2187-96 (2003) 
 
Carbonic anhydrase 4
Name:Carbonic anhydrase 4
Type:Enzyme
Mol. Mass.:35152.74
Organism:Bos taurus (bovine)
Description:Bovine isozyme, isolated from lung microsomes
Residue:312
BDBM11633
BDBM10856
NameBDBM11633
Synonyms:2-N-(4-amino-3,5-diiodobenzene)-1,3,4-thiadiazole-2,5-disulfonamide aminobenzolamide 26
TypeSmall organic molecule
Emp. Form.C8H7I2N5O4S3
Mol. Mass.587.176
SMILESNc1c(I)cc(cc1I)S(=O)(=O)Nc1nnc(s1)S(N)(=O)=O