Reaction Details
TargetCarbonic anhydrase 9
LigandBDBM11631
Substrate/CompetitorBDBM10856
Meas. Tech.CA Inhibition Assay
Ki 39±n/a nM
Citation Ilies, MAVullo, DPastorek, JScozzafava, AIlies, MCaproiu, MTPastorekova, SSupuran, CT Carbonic anhydrase inhibitors. Inhibition of tumor-associated isozyme IX by halogenosulfanilamide and halogenophenylaminobenzolamide derivatives. J Med Chem46:2187-96 (2003) 
 
Carbonic anhydrase 9
Name:Carbonic anhydrase 9
Type:Enzyme
Mol. Mass.:49669.03
Organism:Homo sapiens (Human)
Description:Catalytic domain of human cloned isozyme was used in the assay
Residue:459
BDBM11631
BDBM10856
NameBDBM11631
Synonyms:2-N-(4-amino-3,5-dibromobenzene)-1,3,4-thiadiazole-2,5-disulfonamide aminobenzolamide 24
TypeSmall organic molecule
Emp. Form.C8H7Br2N5O4S3
Mol. Mass.493.175
SMILESNc1c(Br)cc(cc1Br)S(=O)(=O)Nc1nnc(s1)S(N)(=O)=O