Reaction Details
TargetUbiquitin carboxyl-terminal hydrolase 1
LigandBDBM324947
Substrate/Competitorn/a
Meas. Tech.Ubitquin-Rhodamine 110 Assay for USP1 Activity
IC50<0.002±n/a nM
Citation Buckmelter, AJIoannidis, SFollows, BGustafson, GWang, MCaravella, JAWang, ZFritzen, ELLin, J Purinones as ubiquitin-specific protease 1 inhibitors US Patent US10189841 Publication Date 1/29/2019
 
Ubiquitin carboxyl-terminal hydrolase 1
Name:Ubiquitin carboxyl-terminal hydrolase 1
Type:PROTEIN
Mol. Mass.:88191.62
Organism:Homo sapiens (Human)
Description:ChEMBL_104169
Residue:785
BDBM324947
NameBDBM324947
Synonyms:2-(2-isopropylphenyl)-9-(4- US10399980, Compound I-153
TypeSmall organic molecule
Emp. Form.C26H29N5O2
Mol. Mass.443.5408
SMILESCC(C)c1ccccc1-c1ncc2[nH]c(=O)n(Cc3ccc(CN4CCOCC4)cc3)c2n1