Reaction Details
TargetUbiquitin carboxyl-terminal hydrolase 1
LigandBDBM325028
Substrate/Competitorn/a
Meas. Tech.Ubitquin-Rhodamine 110 Assay for USP1 Activity
IC50<0.002±n/a nM
Citation Buckmelter, AJIoannidis, SFollows, BGustafson, GWang, MCaravella, JAWang, ZFritzen, ELLin, J Purinones as ubiquitin-specific protease 1 inhibitors US Patent US10189841 Publication Date 1/29/2019
 
Ubiquitin carboxyl-terminal hydrolase 1
Name:Ubiquitin carboxyl-terminal hydrolase 1
Type:PROTEIN
Mol. Mass.:88191.62
Organism:Homo sapiens (Human)
Description:ChEMBL_104169
Residue:785
BDBM325028
NameBDBM325028
Synonyms:9-(4-(3-(dimethylamino)propoxy)benzyl)-2-(2- US10399980, Compound I-234 | US11161848, Compound I-234
TypeSmall organic molecule
Emp. Form.C27H33N5O2
Mol. Mass.459.5832
SMILESCC(C)c1ccccc1-c1ncc2n(C)c(=O)n(Cc3ccc(OCCCN(C)C)cc3)c2n1