Reaction Details
TargetUbiquitin carboxyl-terminal hydrolase 1
LigandBDBM325236
Substrate/Competitorn/a
Meas. Tech.Ubitquin-Rhodamine 110 Assay for USP1 Activity
IC50<0.002±n/a nM
Citation Buckmelter, AJIoannidis, SFollows, BGustafson, GWang, MCaravella, JAWang, ZFritzen, ELLin, J Purinones as ubiquitin-specific protease 1 inhibitors US Patent US10189841 Publication Date 1/29/2019
 
Ubiquitin carboxyl-terminal hydrolase 1
Name:Ubiquitin carboxyl-terminal hydrolase 1
Type:PROTEIN
Mol. Mass.:88191.62
Organism:Homo sapiens (Human)
Description:ChEMBL_104169
Residue:785
BDBM325236
NameBDBM325236
Synonyms:2-(2-isopropylpyridin-3- US10399980, Compound I-442
TypeSmall organic molecule
Emp. Form.C29H32N8O
Mol. Mass.508.6174
SMILESCC(C)c1ncccc1-c1ncc2[nH]c(=O)n(Cc3ccc(cc3)-n3ccc(n3)C3CCN(C)CC3)c2n1