Reaction Details
TargetMetabotropic glutamate receptor 2
LigandBDBM213078
Substrate/Competitorn/a
Meas. Tech.Biological Assay
IC50 7.00±n/a nM
Citation Bungard, CJConverso, ADe Leon, PHanney, BHartingh, TJManikowski, JJManley, PJMeissner, RMeng, ZPerkins, JJRudd, MTShu, Y Quinoline carboxamide and quinoline carbonitrile derivatives as mGluR2-negative allosteric modulators, compositions, and their use US Patent US9636337 Publication Date 5/2/2017
 
Metabotropic glutamate receptor 2
Name:Metabotropic glutamate receptor 2
Type:Enzyme
Mol. Mass.:95584.88
Organism:Homo sapiens (Human)
Description:Q14416
Residue:872
BDBM213078
NameBDBM213078
Synonyms:US9278960, 6-25 | US9663506, Example 6-25
TypeSmall organic molecule
Emp. Form.C21H15ClF3N5O
Mol. Mass.445.825
SMILESCn1cc(cn1)-c1cc(nc2cc(Cc3cc(Cl)nc(c3)C(F)(F)F)ccc12)C(N)=O