Reaction Details
TargetMetabotropic glutamate receptor 2
LigandBDBM325995
Substrate/Competitorn/a
Meas. Tech.Biological Assay
IC50 7.00±n/a nM
Citation Bungard, CJConverso, ADe Leon, PHanney, BHartingh, TJManikowski, JJManley, PJMeissner, RMeng, ZPerkins, JJRudd, MTShu, Y Quinoline carboxamide and quinoline carbonitrile derivatives as mGluR2-negative allosteric modulators, compositions, and their use US Patent US9636337 Publication Date 5/2/2017
 
Metabotropic glutamate receptor 2
Name:Metabotropic glutamate receptor 2
Type:Enzyme
Mol. Mass.:95584.88
Organism:Homo sapiens (Human)
Description:Q14416
Residue:872
BDBM325995
NameBDBM325995
Synonyms:4-(2-fluoro-4-methoxyphenyl)-7-[1-(2-methylpyrimidin-5-yl)propan-2(S)-yl]quinoline-2-carboxamide | US9636337, 8-10
TypeSmall organic molecule
Emp. Form.C25H23FN4O2
Mol. Mass.430.4741
SMILESCOc1ccc(c(F)c1)-c1cc(nc2cc(ccc12)[C@@H](C)Cc1cnc(C)nc1)C(N)=O