Reaction Details
TargetMetabotropic glutamate receptor 2
LigandBDBM213113
Substrate/Competitorn/a
Meas. Tech.Biological Assay
IC50 6.00±n/a nM
Citation Bungard, CJConverso, ADe Leon, PHanney, BHartingh, TJManikowski, JJManley, PJMeissner, RMeng, ZPerkins, JJRudd, MTShu, Y Quinoline carboxamide and quinoline carbonitrile derivatives as mGluR2-negative allosteric modulators, compositions, and their use US Patent US9636337 Publication Date 5/2/2017
 
Metabotropic glutamate receptor 2
Name:Metabotropic glutamate receptor 2
Type:Enzyme
Mol. Mass.:95584.88
Organism:Homo sapiens (Human)
Description:Q14416
Residue:872
BDBM213113
NameBDBM213113
Synonyms:US9278960, 8-20 US9278960, 8-28 | US9636337, 8-28
TypeSmall organic molecule
Emp. Form.C24H20ClN3O3
Mol. Mass.433.887
SMILESCOc1ccc(cc1)-c1cc(nc2cc(ccc12)C(O)Cc1ccc(Cl)nc1)C(N)=O