Reaction Details
TargetMetabotropic glutamate receptor 2
LigandBDBM213143
Substrate/Competitorn/a
Meas. Tech.Biological Assay
IC50 4.00±n/a nM
Citation Bungard, CJConverso, ADe Leon, PHanney, BHartingh, TJManikowski, JJManley, PJMeissner, RMeng, ZPerkins, JJRudd, MTShu, Y Quinoline carboxamide and quinoline carbonitrile derivatives as mGluR2-negative allosteric modulators, compositions, and their use US Patent US9636337 Publication Date 5/2/2017
 
Metabotropic glutamate receptor 2
Name:Metabotropic glutamate receptor 2
Type:Enzyme
Mol. Mass.:95584.88
Organism:Homo sapiens (Human)
Description:Q14416
Residue:872
BDBM213143
NameBDBM213143
Synonyms:US9278960, 8-50 | US9636337, 8-50
TypeSmall organic molecule
Emp. Form.C24H21FN4O2
Mol. Mass.416.4475
SMILESCOc1ccc(cc1F)-c1cc(nc2cc(CCc3cnc(C)nc3)ccc12)C(N)=O