Reaction Details
TargetPhosphatidylinositol 4,5-bisphosphate 3-kinase catalytic subunit gamma isoform
LigandBDBM326252
Substrate/Competitorn/a
Meas. Tech.Inhibition Assay
IC50 1.60±n/a nM
Citation Ruan, F Heterocyclic compounds as inhibitors of class I PI3KS US Patent US9637488 Publication Date 5/2/2017
 
Phosphatidylinositol 4,5-bisphosphate 3-kinase catalytic subunit gamma isoform
Name:Phosphatidylinositol 4,5-bisphosphate 3-kinase catalytic subunit gamma isoform
Type:Enzyme Subunit
Mol. Mass.:126470.30
Organism:Homo sapiens (Human)
Description:P48736
Residue:1102
BDBM326252
NameBDBM326252
Synonyms:4-amino-6-(2-(7-fluoro-2-morpholinoquinolin-3-yl)pyrrolidin-1-yl)pyrimidine-5-carbonitrile | US9637488, 7
TypeSmall organic molecule
Emp. Form.C22H22FN7O
Mol. Mass.419.4548
SMILESNc1ncnc(N2CCCC2c2cc3ccc(F)cc3nc2N2CCOCC2)c1C#N