Reaction Details
TargetAcetylcholinesterase
LigandBDBM11686
Substrate/CompetitorBDBM8959
Meas. Tech.Cholinesterase Inhibition Assay
pH8±n/a
Temperature295.15±n/a K
IC50 5120±n/a nM
Citation Bartolucci, CSiotto, MGhidini, EAmari, GBolzoni, PTRacchi, MVilletti, GDelcanale, MLamba, D Structural determinants of Torpedo californica acetylcholinesterase inhibition by the novel and orally active carbamate based anti-alzheimer drug ganstigmine (CHF-2819). J Med Chem49:5051-8 (2006) 
 
Acetylcholinesterase
Name:Acetylcholinesterase
Type:n/a
Mol. Mass.:65900.74
Organism:Tetronarce californica (Pacific electric ray) (Torpedo californica)
Description:P04058
Residue:586
BDBM11686
BDBM8959
NameBDBM11686
Synonyms:(-)-O-[(2-ethylphenyl)carbamoyl]geneseroline (3aS,8aS)-5-{[(2-ethylphenyl)carbamoyl]oxy}-1,3a,8-trimethyl-1-oxido-1H,2H,3H,3aH,8H,8aH-pyrrolo[2,3-b]indol-1-ium hydrochloride Compound 3 | Ganstigmine (CHF-2819)
TypeSmall organic molecule
Emp. Form.C22H27N3O3
Mol. Mass.381.4681
SMILES[H][C@@]12N(C)c3ccc(OC(=O)Nc4ccccc4CC)cc3[C@]1(C)CC[N+]2(C)[O-]