Reaction Details
TargetAcetylcholinesterase
LigandBDBM11689
Substrate/CompetitorBDBM8959
Meas. Tech.Cholinesterase Inhibition Assay
pH8±n/a
Temperature295.15±n/a K
IC50 5130±n/a nM
Citation Bartolucci, CSiotto, MGhidini, EAmari, GBolzoni, PTRacchi, MVilletti, GDelcanale, MLamba, D Structural determinants of Torpedo californica acetylcholinesterase inhibition by the novel and orally active carbamate based anti-alzheimer drug ganstigmine (CHF-2819). J Med Chem49:5051-8 (2006) 
 
Acetylcholinesterase
Name:Acetylcholinesterase
Type:n/a
Mol. Mass.:65900.74
Organism:Tetronarce californica (Pacific electric ray) (Torpedo californica)
Description:P04058
Residue:586
BDBM11689
BDBM8959
NameBDBM11689
Synonyms:(3aS,8aS)-1,3a,8-trimethyl-5-{[(3-methylphenyl)carbamoyl]oxy}-1-oxido-1H,2H,3H,3aH,8H,8aH-pyrrolo[2,3-b]indol-1-ium hydrochloride | Ganstigmine (CHF-2819) Analogue 6
TypeSmall organic molecule
Emp. Form.C21H25N3O3
Mol. Mass.367.4415
SMILES[H][C@@]12N(C)c3ccc(OC(=O)Nc4cccc(C)c4)cc3[C@]1(C)CC[N+]2(C)[O-]