Reaction Details
TargetCollagenase ColG
LigandBDBM11769
Substrate/CompetitorBDBM11462
Meas. Tech.ChC Enzyme Inhibition Assay
Ki 11±n/a nM
Citation Scozzafava, ASupuran, CT Protease inhibitors. Part 8: synthesis of potent Clostridium histolyticum collagenase inhibitors incorporating sulfonylated L-alanine hydroxamate moieties. Bioorg Med Chem8:637-45 (2000) 
 
Collagenase ColG
Name:Collagenase ColG
Type:Enzyme
Mol. Mass.:126246.16
Organism:Clostridium histolyticum
Description:Q9S0X0
Residue:1118
BDBM11769
BDBM11462
NameBDBM11769
Synonyms:2-{[(2-chlorophenyl)methyl](3-nitrobenzene)sulfonamido}-N-hydroxypropanamide | hydroxamate deriv. B15
TypeSmall organic molecule
Emp. Form.C16H16ClN3O6S
Mol. Mass.413.833
SMILESCC(N(Cc1ccccc1Cl)S(=O)(=O)c1cccc(c1)[N+]([O-])=O)C(=O)NO