Reaction Details
TargetCollagenase ColG
LigandBDBM11787
Substrate/CompetitorBDBM11462
Meas. Tech.ChC Enzyme Inhibition Assay
Ki 11±n/a nM
Citation Scozzafava, ASupuran, CT Protease inhibitors. Part 8: synthesis of potent Clostridium histolyticum collagenase inhibitors incorporating sulfonylated L-alanine hydroxamate moieties. Bioorg Med Chem8:637-45 (2000) 
 
Collagenase ColG
Name:Collagenase ColG
Type:Enzyme
Mol. Mass.:126246.16
Organism:Clostridium histolyticum
Description:Q9S0X0
Residue:1118
BDBM11787
BDBM11462
NameBDBM11787
Synonyms:2-{[(2-chlorophenyl)methyl](thiophene-2-)sulfonamido}-N-hydroxypropanamide | hydroxamate deriv. B33
TypeSmall organic molecule
Emp. Form.C14H15ClN2O4S2
Mol. Mass.374.863
SMILESCC(N(Cc1ccccc1Cl)S(=O)(=O)c1cccs1)C(=O)NO