Reaction Details
TargetCollagenase ColG
LigandBDBM11814
Substrate/CompetitorBDBM11462
Meas. Tech.ChC Enzyme Inhibition Assay
Ki 12±n/a nM
Citation Scozzafava, ASupuran, CT Protease inhibitors. Part 8: synthesis of potent Clostridium histolyticum collagenase inhibitors incorporating sulfonylated L-alanine hydroxamate moieties. Bioorg Med Chem8:637-45 (2000) 
 
Collagenase ColG
Name:Collagenase ColG
Type:Enzyme
Mol. Mass.:126246.16
Organism:Clostridium histolyticum
Description:Q9S0X0
Residue:1118
BDBM11814
BDBM11462
NameBDBM11814
Synonyms:2-{[(2-chlorophenyl)methyl][(2-nitrophenyl)sulfanyl]amino}-N-hydroxypropanamide | hydroxamate deriv. H2
TypeSmall organic molecule
Emp. Form.C16H16ClN3O4S
Mol. Mass.381.834
SMILESCC(N(Cc1ccccc1Cl)Sc1ccccc1[N+]([O-])=O)C(=O)NO