Reaction Details
Target5-hydroxytryptamine receptor 4
LigandBDBM327445
Substrate/Competitorn/a
Meas. Tech.Competition Assay
Ki 8.90±n/a nM
Citation Dallemagne, PRochais, CLecoutey, CBoulouard, MFreret, T Acetylcholinesterase inhibitors and promnesiant serotonin 5-HT4 receptor agonists, their methods of preparation and the pharmaceutical compositions containing the same US Patent US9663465 Publication Date 5/30/2017
 
5-hydroxytryptamine receptor 4
Name:5-hydroxytryptamine receptor 4
Type:Enzyme
Mol. Mass.:43767.54
Organism:Homo sapiens (Human)
Description:Q13639
Residue:388
BDBM327445
NameBDBM327445
Synonyms:1-(4-amino-5-bromo-2-methoxyphenyl)-3-[1-butyl-4-piperidyl]propan-1-one | US9663465, 2
TypeSmall organic molecule
Emp. Form.C19H28BrNO2
Mol. Mass.382.335
SMILESCCCCN1CCC(CCC(=O)c2cc(Br)ccc2OC)CC1