Reaction Details
Target5-hydroxytryptamine receptor 4
LigandBDBM327448
Substrate/Competitorn/a
Meas. Tech.Competition Assay
Ki 3.80±n/a nM
Citation Dallemagne, PRochais, CLecoutey, CBoulouard, MFreret, T Acetylcholinesterase inhibitors and promnesiant serotonin 5-HT4 receptor agonists, their methods of preparation and the pharmaceutical compositions containing the same US Patent US9663465 Publication Date 5/30/2017
 
5-hydroxytryptamine receptor 4
Name:5-hydroxytryptamine receptor 4
Type:Enzyme
Mol. Mass.:43767.54
Organism:Homo sapiens (Human)
Description:Q13639
Residue:388
BDBM327448
NameBDBM327448
Synonyms:1-(4-amino-5-fluoro-2-methoxyphenyl)-3-[1-(cyclohexylmethyl)-4-piperidyl]propan-1-one | US9663465, 5
TypeSmall organic molecule
Emp. Form.C22H33FN2O2
Mol. Mass.376.508
SMILESCOc1cc(N)c(F)cc1C(=O)CCC1CCN(CC2CCCCC2)CC1