Reaction Details
Target5-hydroxytryptamine receptor 4
LigandBDBM50079364
Substrate/Competitorn/a
Meas. Tech.Competition Assay
Ki 8.80±n/a nM
Citation Dallemagne, PRochais, CLecoutey, CBoulouard, MFreret, T Acetylcholinesterase inhibitors and promnesiant serotonin 5-HT4 receptor agonists, their methods of preparation and the pharmaceutical compositions containing the same US Patent US9663465 Publication Date 5/30/2017
 
5-hydroxytryptamine receptor 4
Name:5-hydroxytryptamine receptor 4
Type:Enzyme
Mol. Mass.:43767.54
Organism:Homo sapiens (Human)
Description:Q13639
Residue:388
BDBM50079364
NameBDBM50079364
Synonyms:CHEMBL3416995 | US9663465, 7
TypeSmall organic molecule
Emp. Form.C20H29ClN2O2
Mol. Mass.364.909
SMILESCOc1cc(N)c(Cl)cc1C(=O)CCC1CCN(CC2CCC2)CC1