Reaction Details
Target5-hydroxytryptamine receptor 4
LigandBDBM327456
Substrate/Competitorn/a
Meas. Tech.Competition Assay
Ki 2.50±n/a nM
Citation Dallemagne, PRochais, CLecoutey, CBoulouard, MFreret, T Acetylcholinesterase inhibitors and promnesiant serotonin 5-HT4 receptor agonists, their methods of preparation and the pharmaceutical compositions containing the same US Patent US9663465 Publication Date 5/30/2017
 
5-hydroxytryptamine receptor 4
Name:5-hydroxytryptamine receptor 4
Type:Enzyme
Mol. Mass.:43767.54
Organism:Homo sapiens (Human)
Description:Q13639
Residue:388
BDBM327456
NameBDBM327456
Synonyms:1-(4-amino-5-chloro-2-methoxyphenyl)-3-[1-[(piperidin-4-yl)methyl]-4-piperidyl] propan-1-one | US9663465, 13
TypeSmall organic molecule
Emp. Form.C21H32ClN3O2
Mol. Mass.393.951
SMILESCOc1cc(N)c(Cl)cc1C(=O)CCC1CCN(CC2CCNCC2)CC1