Reaction Details
Target5-hydroxytryptamine receptor 4
LigandBDBM50079368
Substrate/Competitorn/a
Meas. Tech.Competition Assay
Ki 8.20±n/a nM
Citation Dallemagne, PRochais, CLecoutey, CBoulouard, MFreret, T Acetylcholinesterase inhibitors and promnesiant serotonin 5-HT4 receptor agonists, their methods of preparation and the pharmaceutical compositions containing the same US Patent US9663465 Publication Date 5/30/2017
 
5-hydroxytryptamine receptor 4
Name:5-hydroxytryptamine receptor 4
Type:Enzyme
Mol. Mass.:43767.54
Organism:Homo sapiens (Human)
Description:Q13639
Residue:388
BDBM50079368
NameBDBM50079368
Synonyms:CHEMBL3416999 | US9663465, 16
TypeSmall organic molecule
Emp. Form.C23H35ClN2O2
Mol. Mass.406.989
SMILESCOc1cc(N)c(Cl)cc1C(=O)CCC1CCN(CCC2CCCCC2)CC1