Reaction Details
Target5-hydroxytryptamine receptor 4
LigandBDBM327461
Substrate/Competitorn/a
Meas. Tech.Competition Assay
Ki 5.40±n/a nM
Citation Dallemagne, PRochais, CLecoutey, CBoulouard, MFreret, T Acetylcholinesterase inhibitors and promnesiant serotonin 5-HT4 receptor agonists, their methods of preparation and the pharmaceutical compositions containing the same US Patent US9663465 Publication Date 5/30/2017
 
5-hydroxytryptamine receptor 4
Name:5-hydroxytryptamine receptor 4
Type:Enzyme
Mol. Mass.:43767.54
Organism:Homo sapiens (Human)
Description:Q13639
Residue:388
BDBM327461
NameBDBM327461
Synonyms:4-amino-5-bromo-N-[[1-(cyclohexylmethyl)-4-piperidyl]methyl]-2-methoxybenzamide | US9663465, 18
TypeSmall organic molecule
Emp. Form.C21H32BrN3O2
Mol. Mass.438.402
SMILESCOc1cc(N)c(Br)cc1C(=O)NCC1CCN(CC2CCCCC2)CC1