Reaction Details
Target5-hydroxytryptamine receptor 4
LigandBDBM327466
Substrate/Competitorn/a
Meas. Tech.Competition Assay
Ki 2.50±n/a nM
Citation Dallemagne, PRochais, CLecoutey, CBoulouard, MFreret, T Acetylcholinesterase inhibitors and promnesiant serotonin 5-HT4 receptor agonists, their methods of preparation and the pharmaceutical compositions containing the same US Patent US9663465 Publication Date 5/30/2017
 
5-hydroxytryptamine receptor 4
Name:5-hydroxytryptamine receptor 4
Type:Enzyme
Mol. Mass.:43767.54
Organism:Homo sapiens (Human)
Description:Q13639
Residue:388
BDBM327466
NameBDBM327466
Synonyms:1-[4-amino-5-chloro-2-(2-fluoroéthoxy)phenyl]-3-[1-(cyclohexylmethyl)-4-piperidyl]propan-1-one | US9663465, 23
TypeSmall organic molecule
Emp. Form.C23H34ClFN2O2
Mol. Mass.424.98
SMILESNc1cc(OCCF)c(cc1Cl)C(=O)CCC1CCN(CC2CCCCC2)CC1