Reaction Details
TargetNuclear receptor ROR-gamma
LigandBDBM329645
Substrate/Competitorn/a
Meas. Tech.Binding Assay
Ki<100±n/a nM
Citation Claremon, DADillard, LWDong, CFan, YLotesta, SDMarcus, ASingh, SBTice, CMYuan, JZhao, WZhuang, L Dihydropyrrolopyridine inhibitors of ROR-gamma US Patent US9663515 Publication Date 5/30/2017
 
Nuclear receptor ROR-gamma
Name:Nuclear receptor ROR-gamma
Type:Enzyme Catalytic Domain
Mol. Mass.:58218.40
Organism:Homo sapiens (Human)
Description:P51449
Residue:518
BDBM329645
NameBDBM329645
Synonyms:(S)-7-ethyl-N¿((R)-1-(4-(ethylsulfonyl)phenyl)-2-methoxyethyl)-6-((trans-4-(trifluoromethyl)cyclohexyl)methyl)-6,7-dihydro-5H-pyrrolo[3,4-b]pyridine-3-carboxamide US9663515, Compound 1
TypeSmall organic molecule
Emp. Form.C29H38F3N3O4S
Mol. Mass.581.69
SMILESCC[C@@H]1N(C[C@H]2CC[C@@H](CC2)C(F)(F)F)Cc2cc(cnc12)C(=O)N[C@@H](COC)c1ccc(cc1)S(=O)(=O)CC