Reaction Details
TargetCarbonic anhydrase 2
LigandBDBM11931
Substrate/CompetitorBDBM11402
Meas. Tech.In Vitro Binding for Human Carbonic Anhydrase II
pH7.4±n/a
Temperature310.15±n/a K
Kd 0.83±.35 nM
Citation Boriack-Sjodin, PAZeitlin, SChen, HHCrenshaw, LGross, SDantanarayana, ADelgado, PMay, JADean, TChristianson, DW Structural analysis of inhibitor binding to human carbonic anhydrase II. Protein Sci7:2483-9 (1998) 
 
Carbonic anhydrase 2
Name:Carbonic anhydrase 2
Type:Enzyme
Mol. Mass.:29250.71
Organism:Homo sapiens (Human)
Description:P00918
Residue:260
BDBM11931
BDBM11402
NameBDBM11931
Synonyms:2-N-(thiophen-2-ylmethyl)thiophene-2,5-disulfonamide N-(2-THIENYLMETHYL)-2,5-THIOPHENEDISULFONAMIDE
TypeSmall organic molecule
Emp. Form.C9H10N2O4S4
Mol. Mass.338.447
SMILESNS(=O)(=O)c1ccc(s1)S(=O)(=O)NCc1cccs1