Reaction Details
TargetNon-specific protein-tyrosine kinase [T818I]
LigandBDBM50328123
Substrate/Competitorn/a
Meas. Tech.Kinase Assay
pH7.5±n/a
IC50>10000±n/a nM
Commentsextracted
Citation Gray, NSZhang, JOkram, BDeng, X Small molecule myristate inhibitors of Bcr-abl and methods of use US Patent US9670214 Publication Date 6/6/2017
 
Non-specific protein-tyrosine kinase [T818I]
Name:Non-specific protein-tyrosine kinase [T818I]
Type:Protein
Mol. Mass.:178608.54
Organism:Homo sapiens (Human)
Description:A9UEZ6[T818I]
Residue:1633
BDBM50328123
NameBDBM50328123
Synonyms:1-((tetrahydrofuran-3-yl)methyl)-N-(4-(trifluoromethoxy)phenyl)-1H-pyrazolo[3,4-d]pyrimidin-4-amine US9670214, TABLE 10.12
TypeSmall organic molecule
Emp. Form.C17H16F3N5O2
Mol. Mass.379.3364
SMILESFC(F)(F)Oc1ccc(Nc2ncnc3n(CC4CCOC4)ncc23)cc1