Reaction Details
TargetFalcipain-2
LigandBDBM12040
Substrate/CompetitorBDBM12033
Meas. Tech.Falcipain Enzyme Inhibition Assay
pH5.5±n/a
Temperature295.15±n/a K
IC50 12500±n/a nM
Citation Dominguez, JNLeon, CRodrigues, JGamboa de Dominguez, NGut, JRosenthal, PJ Synthesis and evaluation of new antimalarial phenylurenyl chalcone derivatives. J Med Chem48:3654-8 (2005) 
 
Falcipain-2
Name:Falcipain-2
Synonyms:n/a
Type:Enzyme
Mol. Mass.:55912.57
Organism:Plasmodium falciparum
Description:n/a
Residue:484
BDBM12040
BDBM12033
NameBDBM12040
TypeSmall organic molecule
Emp. Form.C22H19N3O3
Mol. Mass.373.4046
SMILESCOc1ccc(NC(=O)Nc2ccc(cc2)C(=O)\C=C\c2cccnc2)cc1