Reaction Details
TargetCystathionine gamma-lyase
LigandBDBM330322
Substrate/Competitorn/a
Meas. Tech.In Vitro Assay
IC50<10000±n/a nM
Citation Durón, SGChapman, JSydserff, SGRao, SGStein, GWade, W Cystathionine-γ-lyase (CSE) inhibitors US Patent US9725426 Publication Date 8/8/2017
 
Cystathionine gamma-lyase
Name:Cystathionine gamma-lyase
Type:Protein
Mol. Mass.:44509.52
Organism:Homo sapiens (Human)
Description:P32929
Residue:405
BDBM330322
NameBDBM330322
Synonyms:US9725426, 26
TypeSmall organic molecule
Emp. Form.C12H15N7O
Mol. Mass.273.2938
SMILESCN(C)c1ccc(cc1)C(=O)C\C=N\Nc1nnn[nH]1