Reaction Details
TargetCarbonic anhydrase 1
LigandBDBM10883
Substrate/CompetitorBDBM10856
Meas. Tech.CA Inhibition Assay
pH7.5±n/a
Temperature293.15±n/a K
Ki 1200±n/a nM
Citation Winum, JYDogne, JMCasini, Ade Leval, XMontero, JLScozzafava, AVullo, DInnocenti, ASupuran, CT Carbonic anhydrase inhibitors: synthesis and inhibition of cytosolic/membrane-associated carbonic anhydrase isozymes I, II, and IX with sulfonamides incorporating hydrazino moieties. J Med Chem48:2121-5 (2005) 
 
Carbonic anhydrase 1
Name:Carbonic anhydrase 1
Type:Enzyme
Mol. Mass.:28873.37
Organism:Homo sapiens (Human)
Description:P00915
Residue:261
BDBM10883
BDBM10856
NameBDBM10883
Synonyms:4,5-dichlorobenzene-1,3-disulfonamide Dichlorophenamide Dichlorophenamide, DCP US10172837, Dichlorphenamide | sulfonamide 4
TypeSmall organic molecule
Emp. Form.C6H6Cl2N2O4S2
Mol. Mass.305.159
SMILESNS(=O)(=O)c1cc(Cl)c(Cl)c(c1)S(N)(=O)=O