Reaction Details
TargetCathepsin K
LigandBDBM331539
Substrate/Competitorn/a
Meas. Tech.Enzyme Assay
Ki 5.00±n/a nM
Citation Nardi, ARatcliffe, PCraan, THertrampf, TLesch, BKime, RSteinhagen, H 3-oxo-tetrahydro-furo[3,2-B]pyrrol-4(5H)-yl) derivatives I US Patent US9725459 Publication Date 8/8/2017
 
Cathepsin K
Name:Cathepsin K
Type:Enzyme
Mol. Mass.:36975.68
Organism:Homo sapiens (Human)
Description:P43235
Residue:329
BDBM331539
NameBDBM331539
Synonyms:N-((S)-2-((3aS,6S,6aS)-6-chloro-3-oxotetrahydro-2H-furo[3,2-b]pyrrol-4(5H)-yl)-1-cyclohexyl-2-oxoethyl)-5-(pyridin-3-yl)thiophene-2-carboxamide | US9725459, 2
TypeSmall organic molecule
Emp. Form.C24H28ClN3O4S
Mol. Mass.490.015
SMILESO[C@H]1CO[C@@H]2[C@@H](Cl)CN([C@H]12)C(=O)[C@@H](NC(=O)c1ccc(s1)-c1cccnc1)C1CCCCC1